Target
Stromelysin-1
Ligand
BDBM50366204
Substrate
Meas. Tech.
ChEMBL_805644 (CHEMBL1960478)
IC50
160±n/a nM
Citation
 Topai, ABreccia, PMinissi, FPadova, AMarini, SCerbara, I In silico scaffold evaluation and solid phase approach to identify new gelatinase inhibitors. Bioorg Med Chem 20:2323-37 (2012)  
Target
Name:
Stromelysin-1
Synonyms:
MMP-3 MMP3_HUMAN Matrix metalloproteinase 3 Matrix metalloproteinase-3 (MMP-3) SL-1 Stromelysin 1 | Transin-1
Type:
Enzyme
Mol. Mass.:
53973.13
Organism:
Homo sapiens (Human)
Description:
P08254
Residue:
477
  
Inhibitor
Name:
BDBM50366204
Synonyms:
CHEMBL1957602
Type:
Small organic molecule
Emp. Form.:
C16H15ClN2O5S2
Mol. Mass.:
414.884
SMILES:
ONC(=O)[C@@H]1CSCN1S(=O)(=O)c1ccc(Oc2ccc(Cl)cc2)cc1
: