Target
Platelet-activating factor receptor
Ligand
BDBM50001747
Substrate
Meas. Tech.
ChEBML_155147
IC50
150±n/a nM
Citation
 Sahoo, SPGraham, DWActon, JBiftu, TBugianesi, RLGirotra, NNKuo, CPonpipom, MMDoebber, TWWu, MSHwang, SLam, MMacIntyre, DBach, TJLuell, SMeurer, RDavies, PAlberts, AWChabala, JC Synthesis and biological activity of MK 287 (L-680,573): a potent, specific and orally active paf receptor antagonist Bioorg Med Chem Lett 1:327-332 (1991)    Article 
Target
Name:
Platelet-activating factor receptor
Synonyms:
PAF-R PTAFR_CAVPO Platelet-activating factor receptor
Type:
Protein
Mol. Mass.:
39005.63
Organism:
Cavia porcellus
Description:
Residue:
342
  
Inhibitor
Name:
BDBM50001747
Synonyms:
(+)-Kadsurenone 5-Allyl-2-(3,4-dimethoxy-phenyl)-3a-methoxy-3-methyl-3,3a-dihydro-2H-benzofuran-6-one KADSURENONE
Type:
Small organic molecule
Emp. Form.:
C21H24O5
Mol. Mass.:
356.4123
SMILES:
COc1ccc(cc1OC)[C@H]1OC2=CC(=O)C(CC=C)=C[C@]2(OC)[C@@H]1C
: