Target
Tyrosine-protein phosphatase non-receptor type 1
Ligand
BDBM50110681
Substrate
Meas. Tech.
ChEBML_161423
IC50
0.300000±n/a nM
Citation
 Quinn, RJTaylor, CSuganuma, MFujiki, H The conserved acid binding domain model of inhibitors of protein phosphatases 1 and 2A: Molecular modelling aspects. Bioorg Med Chem Lett 3:1029-1034 (1993)    Article 
Target
Name:
Tyrosine-protein phosphatase non-receptor type 1
Synonyms:
PTN1_HUMAN PTPN1 Protein tyrosine phosphatase-1B (PTP1B) Protein-tyrosine phosphatase 1B (PTP1B) Tyrosine-protein phosphatase non-receptor type 1 (PTP1B)
Type:
Protein phosphatase
Mol. Mass.:
49963.76
Organism:
Homo sapiens (Human)
Description:
Human recombinant GST-fusion PTP1B (1-435).
Residue:
435
  
Inhibitor
Name:
BDBM50110681
Synonyms:
CHEMBL430266 | Calyculin-A
Type:
Small organic molecule
Emp. Form.:
C50H81N4O15P
Mol. Mass.:
1009.1697
SMILES:
COC[C@@H]([C@H](O)[C@H](O)C(=O)NCC[C@H](C)c1nc(\C=C\C[C@@H]2O[C@]3(C[C@@H](O)[C@@H]2C)O[C@H]([C@H](C[C@H](O)[C@H](C)[C@H](O)[C@H](C)\C=C(/C)\C(\C)=C\C=C\C(\C)=C/C#N)OC)[C@H](OP(O)(O)=O)C3(C)C)co1)N(C)C
: