Target
5-hydroxytryptamine receptor 4
Ligand
BDBM50105630
Substrate
Meas. Tech.
ChEBML_3320
Ki
54±n/a nM
Citation
 Lopez-Rodriguez, MLMorcillo, MJBenhamu, BRiaguas, MD Novel benzimidazole-4-carboxylic acid derivatives as potent and selective 5-HT3 receptor ligands Bioorg Med Chem Lett 6:1195-1198 (1996)    Article 
Target
Name:
5-hydroxytryptamine receptor 4
Synonyms:
5-HT-4 5-HT4L 5-hydroxytryptamine receptor 4 Htr4 Serotonin 4 (5-HT4) receptor
Type:
Enzyme Catalytic Domain
Mol. Mass.:
46117.31
Organism:
RAT
Description:
5-HT4 HTR4 RAT::Q62758
Residue:
406
  
Inhibitor
Name:
BDBM50105630
Synonyms:
6-Chloro-1H-benzoimidazole-4-carboxylic acid (1-methyl-piperidin-4-yl)-amide | CHEMBL18769
Type:
Small organic molecule
Emp. Form.:
C14H17ClN4O
Mol. Mass.:
292.764
SMILES:
CN1CCC(CC1)NC(=O)c1cc(Cl)cc2nc[nH]c12
: