Target
Glutamate receptor ionotropic, NMDA 1
Ligand
BDBM50069473
Substrate
Meas. Tech.
ChEBML_140302
IC50
280±n/a nM
Citation
 Acklin, PAllgeier, HAuberson, YPBischoff, SOfner, SSauer, DSchmutz, M 5-Aminomethylquinoxaline-2,3-diones, Part III: Arylamide derivatives as highly potent and selective glycine-site NMDA receptor antagonists. Bioorg Med Chem Lett 8:493-8 (1999)  
Target
Name:
Glutamate receptor ionotropic, NMDA 1
Synonyms:
Glutamate (NMDA) receptor subunit zeta 1 Glutamate-NMDA-Channel Glutamate-NMDA-Polyamine NMDA Nmdar1 | phencyclidine
Type:
Enzyme Catalytic Domain
Mol. Mass.:
105533.40
Organism:
RAT
Description:
P35439
Residue:
938
  
Inhibitor
Name:
BDBM50069473
Synonyms:
CHEMBL538070 | N-(7-Bromo-2,3-dioxo-1,2,3,4-tetrahydro-quinoxalin-5-ylmethyl)-nicotinamide; hydrochloride
Type:
Small organic molecule
Emp. Form.:
C15H11BrN4O3
Mol. Mass.:
375.177
SMILES:
Brc1cc(CNC(=O)c2cccnc2)c2[nH]c(=O)c(=O)[nH]c2c1
: