Target
Aminopeptidase N
Ligand
BDBM50087097
Substrate
Meas. Tech.
ChEMBL_35501 (CHEMBL646411)
Ki
2.2±n/a nM
Citation
 Chen, HRoques, BPFournié-Zaluski, MC Design of the first highly potent and selective aminopeptidase N (EC 3.4.11.2) inhibitor. Bioorg Med Chem Lett 9:1511-6 (1999)  
Target
Name:
Aminopeptidase N
Synonyms:
AMPN_PIG AP-M Alanyl aminopeptidase Aminopeptidase N (APN) Microsomal aminopeptidase pAPN
Type:
Protein
Mol. Mass.:
108810.25
Organism:
Sus scrofa (Pig)
Description:
P15145
Residue:
963
  
Inhibitor
Name:
BDBM50087097
Synonyms:
1-{[2-(1-Carboxy-2-phenyl-ethylcarbamoyl)-3-phenyl-propyl]-hydroxy-phosphinoyl}-ethyl-ammonium
Type:
Small organic molecule
Emp. Form.:
C21H28N2O5P
Mol. Mass.:
419.4306
SMILES:
CC([NH3+])P(O)(=O)C[C@@H](Cc1ccccc1)C(=O)N[C@@H](Cc1ccccc1)C(O)=O
: