Target
Kappa-type opioid receptor
Ligand
BDBM50082341
Substrate
Meas. Tech.
ChEBML_92405
Kd
2952±n/a nM
Citation
 Thomas, JBAtkinson, RNHerault, XMRothman, RBMascarella, SWDersch, CMXu, HHorel, RBCarroll, FI Optically pure (-)-4-[(N-allyl-3-methyl-4-piperidinyl)phenyl-amino]-N,N-diethylbenzami de displays selective binding and full agonist activity for the delta opioid receptor. Bioorg Med Chem Lett 9:3347-50 (2000)  
Target
Name:
Kappa-type opioid receptor
Synonyms:
Kappa Opioid Receptor OPRK1 Opiate Kappa 1 | mu/kappa opioid receptor
Type:
G Protein-Coupled Receptor (GPCR)
Mol. Mass.:
42744.99
Organism:
Cavia porcellus (domestic guinea pig)
Description:
P41144
Residue:
380
  
Inhibitor
Name:
BDBM50082341
Synonyms:
4-[((3R,4S)-1-Allyl-3-methyl-piperidin-4-yl)-phenyl-amino]-N,N-diethyl-benzamide | CHEMBL102497
Type:
Small organic molecule
Emp. Form.:
C26H35N3O
Mol. Mass.:
405.5756
SMILES:
CCN(CC)C(=O)c1ccc(cc1)N([C@H]1CCN(CC=C)C[C@H]1C)c1ccccc1
: