Target
alpha-1,2-Mannosidase
Ligand
BDBM50104296
Substrate
Meas. Tech.
ChEMBL_32383 (CHEMBL646764)
Ki
80000±n/a nM
Citation
 Popowycz, FGerber-Lemaire, SDemange, RRodriguez-García, EAsenjo, ATRobina, IVogel, P Derivatives of (2R,3R,4S)-2-aminomethylpyrrolidine-3,4-diol are selective alpha-mannosidase inhibitors. Bioorg Med Chem Lett 11:2489-93 (2001)  
Target
Name:
alpha-1,2-Mannosidase
Synonyms:
Alpha-mannosidase
Type:
PROTEIN
Mol. Mass.:
65344.50
Organism:
Glycine max
Description:
ChEMBL_32380
Residue:
578
  
Inhibitor
Name:
BDBM50104296
Synonyms:
2-(2,2-Dihydroxy-ethyl)-pyrrolidine-3,4-diol | CHEMBL83278
Type:
Small organic molecule
Emp. Form.:
C6H13NO4
Mol. Mass.:
163.1717
SMILES:
OC(O)CC1NCC(O)C1O
: