Target
alpha-1,2-Mannosidase
Ligand
BDBM50104301
Substrate
Meas. Tech.
ChEMBL_32383 (CHEMBL646764)
Ki
120000±n/a nM
Citation
 Popowycz, FGerber-Lemaire, SDemange, RRodriguez-García, EAsenjo, ATRobina, IVogel, P Derivatives of (2R,3R,4S)-2-aminomethylpyrrolidine-3,4-diol are selective alpha-mannosidase inhibitors. Bioorg Med Chem Lett 11:2489-93 (2001)  
Target
Name:
alpha-1,2-Mannosidase
Synonyms:
Alpha-mannosidase
Type:
PROTEIN
Mol. Mass.:
65344.50
Organism:
Glycine max
Description:
ChEMBL_32380
Residue:
578
  
Inhibitor
Name:
BDBM50104301
Synonyms:
2-[((R)-1-Hydroxy-ethylamino)-methyl]-pyrrolidine-3,4-diol CHEMBL2206827
Type:
Small organic molecule
Emp. Form.:
C7H16N2O3
Mol. Mass.:
176.2135
SMILES:
C[C@H](O)NC[C@H]1NC[C@H](O)[C@@H]1O
: