Target
Melanocortin receptor 4
Ligand
BDBM50029747
Substrate
Meas. Tech.
ChEBML_106176
EC50
25±n/a nM
Citation
 Cheung, AWDanho, WSwistok, JQi, LKurylko, GFranco, LYagaloff, KChen, L Structure-activity relationship of linear peptide Bu-His-DPhe-Arg-Trp-Gly-NH(2) at the human melanocortin-1 and -4 receptors: arginine substitution. Bioorg Med Chem Lett 12:2407-10 (2002)  
Target
Name:
Melanocortin receptor 4
Synonyms:
MC4-R MC4R_HUMAN Melanocortin receptor 4 (MC-4) Melanocortin receptor 4 (MC4R)
Type:
Enzyme
Mol. Mass.:
36949.50
Organism:
Homo sapiens (Human)
Description:
P32245
Residue:
332
  
Inhibitor
Name:
BDBM50029747
Synonyms:
(4S)-4-{[(1S)-1-{[(1S)-1-{[(1S)-1-{[(1S)-1-[({[(2S)-6-amino-1-[(2S)-2-{[(1S)-1-carbamoyl-2-methylpropyl]carbamoyl}pyrrolidin-1-yl]-1-oxohexan-2-yl]carbamoyl}methyl)carbamoyl]-2-(1H-indol-3-yl)ethyl]carbamoyl}-4-carbamimidamidobutyl]carbamoyl}-2-phenylethyl]carbamoyl}-2-(1H-imidazol-5-yl)ethyl]carbamoyl}-4-[(2S)-2-[(2S)-2-[(2S)-2-[(2S)-2-acetamido-3-hydroxypropanamido]-3-(4-hydroxyphenyl)propanamido]-3-hydroxypropanamido]-4-(methylsulfanyl)butanamido]butanoic acid Ac-S-Y-S-M-E-H-F-R-W-G-K-P-V-NH2 Ac-Ser-Tyr-Nle-Glu-His-D-Phe-Arg-Trp-Gly-Lys-Pro-Val-NH2 Ac-Ser-Tyr-Ser-Met-Glu-His-Phe-Arg-Trp-Gly-Lys-Pro-Val-NH2(alpha-MSH) Ac-Ser-Tyr-Ser-Met-Glu-His6-Phe7-Arg8-Trp9-Gly-Lys-Pro-Val-NH2 CHEMBL214332 alpha-MSH; Ac-Ser-Tyr-Ser-Met-Glu-His-DPhe-Arg-Trp-Gly-Lys-Pro-Val-NH2
Type:
Small organic molecule
Emp. Form.:
C77H109N21O19S
Mol. Mass.:
1664.884
SMILES:
CSCC[C@H](NC(=O)[C@H](CO)NC(=O)[C@H](Cc1ccc(O)cc1)NC(=O)[C@H](CO)NC(C)=O)C(=O)N[C@@H](CCC(O)=O)C(=O)N[C@@H](Cc1cnc[nH]1)C(=O)N[C@@H](Cc1ccccc1)C(=O)N[C@@H](CCCNC(N)=N)C(=O)N[C@@H](Cc1c[nH]c2ccccc12)C(=O)NCC(=O)N[C@@H](CCCCN)C(=O)N1CCC[C@H]1C(=O)N[C@@H](C(C)C)C(N)=O
: