Target
Tissue alpha-L-fucosidase
Ligand
BDBM50118926
Substrate
Meas. Tech.
ChEBML_33957
Ki
180±n/a nM
Citation
 Ogawa, SMori, MTakeuchi, GDoi, FWatanabe, MSakata, Y Convenient synthesis and evaluation of enzyme inhibitory activity of several N-alkyl-, N-phenylalkyl, and cyclic isourea derivatives of 5a-carba-alpha-DL-fucopyranosylamine. Bioorg Med Chem Lett 12:2811-4 (2002)  
Target
Name:
Tissue alpha-L-fucosidase
Synonyms:
Alpha-L-fucosidase I FUCA1 Tissue alpha-L-fucosidase
Type:
PROTEIN
Mol. Mass.:
53690.69
Organism:
Homo sapiens (Human)
Description:
ChEMBL_34088
Residue:
466
  
Inhibitor
Name:
BDBM50118926
Synonyms:
(1R,2S,3S)-4-Ethylamino-6-methyl-cyclohexane-1,2,3-triol | CHEMBL316082
Type:
Small organic molecule
Emp. Form.:
C9H19NO3
Mol. Mass.:
189.2521
SMILES:
CCNC1CC(C)C(O)C(O)C1O
: