Target
Progesterone receptor
Ligand
BDBM50129152
Substrate
Meas. Tech.
ChEBML_159551
Ki
0.340000±n/a nM
Citation
 Zhi, LTegley, CMPio, BEdwards, JPJones, TKMarschke, KBMais, DERisek, BSchrader, WT Synthesis and biological activity of 5-methylidene 1,2-dihydrochromeno[3,4-f]quinoline derivatives as progesterone receptor modulators. Bioorg Med Chem Lett 13:2071-4 (2003)  
Target
Name:
Progesterone receptor
Synonyms:
NR3C3 PGR PRGR_HUMAN | progesterone
Type:
Protein
Mol. Mass.:
98979.52
Organism:
Homo sapiens (Human)
Description:
P06401
Residue:
933
  
Inhibitor
Name:
BDBM50129152
Synonyms:
(6S,8S,10R,14S,15S)-17-Acetyl-6,10-dimethyl-13-(R)-methyl-17-(2-oxo-propyl)-1,2,6,7,8,9,10,11,12,13,14,15,16,17-tetradecahydro-cyclopenta[a]phenanthren-3-one | CHEMBL292284
Type:
Small organic molecule
Emp. Form.:
C25H36O3
Mol. Mass.:
384.5515
SMILES:
C[C@H]1CC2[C@@H]3CC[C@](CC(C)=O)(C(C)=O)[C@@]3(C)CC[C@@H]2[C@@]2(C)CCC(=O)C=C12
: