Target
CMP-N-acetylneuraminate-beta-1,4-galactoside alpha-2,3-sialyltransferase
Ligand
BDBM50366833
Substrate
Meas. Tech.
ChEMBL_216151 (CHEMBL817034)
Ki
300000±n/a nM
Citation
 Whalen, LJMcEvoy, KAHalcomb, RL Synthesis and evaluation of phosphoramidate amino acid-based inhibitors of sialyltransferases. Bioorg Med Chem Lett 13:301-4 (2002)  
Target
Name:
CMP-N-acetylneuraminate-beta-1,4-galactoside alpha-2,3-sialyltransferase
Synonyms:
SIAT6_RAT St3gal3
Type:
PROTEIN
Mol. Mass.:
42091.50
Organism:
Rattus norvegicus
Description:
ChEMBL_649270
Residue:
374
  
Inhibitor
Name:
BDBM50366833
Synonyms:
CHEMBL608928
Type:
Small organic molecule
Emp. Form.:
C20H24N5O9P
Mol. Mass.:
509.4064
SMILES:
Nc1ccn(C2O[C@H](COP(O)(=O)N[C@@H](Cc3c[nH]c4ccccc34)C(O)=O)[C@@H](O)[C@H]2O)c(=O)n1
: