Target
Beta-galactoside alpha-2,6-sialyltransferase 1
Ligand
BDBM50366832
Substrate
Meas. Tech.
ChEMBL_216152 (CHEMBL817949)
Ki
2500000±n/a nM
Citation
 Whalen, LJMcEvoy, KAHalcomb, RL Synthesis and evaluation of phosphoramidate amino acid-based inhibitors of sialyltransferases. Bioorg Med Chem Lett 13:301-4 (2002)  
Target
Name:
Beta-galactoside alpha-2,6-sialyltransferase 1
Synonyms:
CMP-N-acetylneuraminate-beta-galactosamide-alpha-2,6-sialyltransferase Siat1 | St6gal1
Type:
PROTEIN
Mol. Mass.:
46743.36
Organism:
Rattus norvegicus
Description:
ChEMBL_216152
Residue:
403
  
Inhibitor
Name:
BDBM50366832
Synonyms:
CHEMBL609516
Type:
Small organic molecule
Emp. Form.:
C15H25N4O9P
Mol. Mass.:
436.3542
SMILES:
CC(C)C[C@H](NP(O)(=O)OC[C@H]1OC([C@H](O)[C@@H]1O)n1ccc(N)nc1=O)C(O)=O
: