Target
Coagulation factor X
Ligand
BDBM50124861
Substrate
Meas. Tech.
ChEBML_69660
Kd
1800±n/a nM
Citation
 Gunnarsson, GTDesai, UR Exploring new non-sugar sulfated molecules as activators of antithrombin. Bioorg Med Chem Lett 13:679-83 (2003)  
Target
Name:
Coagulation factor X
Synonyms:
Activated coagulation factor X (FXa) Coagulation factor X precursor F10 Factor X heavy chain Factor Xa Stuart-Prower factor
Type:
Enzyme
Mol. Mass.:
54726.60
Organism:
Homo sapiens (Human)
Description:
Residue:
488
  
Inhibitor
Name:
BDBM50124861
Synonyms:
2-[2,4-bis(sulfonatooxy)phenyl]-4-oxo-3,5-bis(sulfonatooxy)-3,4-dihydro-2H-chromen-7-yl sulfate
Type:
Small organic molecule
Emp. Form.:
C15H5O22S5
Mol. Mass.:
697.515
SMILES:
[O-]S(=O)(=O)Oc1ccc(c(OS([O-])(=O)=O)c1)-c1oc2cc(OS([O-])(=O)=O)cc(OS([O-])(=O)=O)c2c(=O)c1OS([O-])(=O)=O
: