Target
Coagulation factor X
Ligand
BDBM50118798
Substrate
Meas. Tech.
ChEBML_69660
Kd
26100±n/a nM
Citation
 Gunnarsson, GTDesai, UR Exploring new non-sugar sulfated molecules as activators of antithrombin. Bioorg Med Chem Lett 13:679-83 (2003)  
Target
Name:
Coagulation factor X
Synonyms:
Activated coagulation factor X (FXa) Coagulation factor X precursor F10 Factor X heavy chain Factor Xa Stuart-Prower factor
Type:
Enzyme
Mol. Mass.:
54726.60
Organism:
Homo sapiens (Human)
Description:
Residue:
488
  
Inhibitor
Name:
BDBM50118798
Synonyms:
(+/-)-CS Sulfuric acid mono-[2-(3,4-bis-sulfooxy -phenyl)-3,5-bis-sulfooxy-chroman-7-yl] ester | (2S,3R)-2-[3,4-bis(sulfonatooxy)phenyl]-3,5-bis(sulfonatooxy)-3,4-dihydro-2H-chromen-7-yl sulfate
Type:
Small organic molecule
Emp. Form.:
C15H9O21S5
Mol. Mass.:
685.547
SMILES:
[O-]S(=O)(=O)O[C@@H]1Cc2c(OS([O-])(=O)=O)cc(OS([O-])(=O)=O)cc2O[C@H]1c1ccc(OS([O-])(=O)=O)c(OS([O-])(=O)=O)c1
: