Target
Dipeptidase 1
Ligand
BDBM50024008
Substrate
Meas. Tech.
ChEBML_216035
Ki
180±n/a nM
Citation
 Graham, DWAshton, WTBarash, LBrown, JEBrown, RDCanning, LFChen, ASpringer, JPRogers, EF Inhibition of the mammalian beta-lactamase renal dipeptidase (dehydropeptidase-I) by (Z)-2-(acylamino)-3-substituted-propenoic acids. J Med Chem 30:1074-90 (1987)  
Target
Name:
Dipeptidase 1
Synonyms:
DPEP1 Dipeptidase 1 Microsomal dipeptidase Renal dipeptidase
Type:
Enzyme Catalytic Domain
Mol. Mass.:
44697.32
Organism:
GUINEA PIG
Description:
Leukotriene D4 Alpha 0 GUINEA PIG::P22412
Residue:
409
  
Inhibitor
Name:
BDBM50024008
Synonyms:
CHEMBL11674 | {7-Carboxy-7-[(2,2-dichloro-cyclopropanecarbonyl)-amino]-hept-6-enyl}-trimethyl-ammonium
Type:
Small organic molecule
Emp. Form.:
C15H25Cl2N2O3
Mol. Mass.:
352.276
SMILES:
C[N+](C)(C)CCCCC\C=C(/NC(=O)C1CC1(Cl)Cl)C(O)=O
: