Target
Dipeptidase 1
Ligand
BDBM50024072
Substrate
Meas. Tech.
ChEBML_216035
Ki
44±n/a nM
Citation
 Graham, DWAshton, WTBarash, LBrown, JEBrown, RDCanning, LFChen, ASpringer, JPRogers, EF Inhibition of the mammalian beta-lactamase renal dipeptidase (dehydropeptidase-I) by (Z)-2-(acylamino)-3-substituted-propenoic acids. J Med Chem 30:1074-90 (1987)  
Target
Name:
Dipeptidase 1
Synonyms:
DPEP1 Dipeptidase 1 Microsomal dipeptidase Renal dipeptidase
Type:
Enzyme Catalytic Domain
Mol. Mass.:
44697.32
Organism:
GUINEA PIG
Description:
Leukotriene D4 Alpha 0 GUINEA PIG::P22412
Residue:
409
  
Inhibitor
Name:
BDBM50024072
Synonyms:
2-[(2,2-Dimethyl-cyclopropanecarbonyl)-amino]-8-ethoxythiocarbonylsulfanyl-oct-2-enoic acid | CHEMBL12008
Type:
Small organic molecule
Emp. Form.:
C17H27NO4S2
Mol. Mass.:
373.531
SMILES:
CCOC(=S)SCCCCC\C=C(/NC(=O)C1CC1(C)C)C(O)=O
: