Target
Cholecystokinin receptor type A
Ligand
BDBM25878
Substrate
Meas. Tech.
ChEBML_49420
IC50
>100000±n/a nM
Citation
 Evans, BERittle, KEBock, MGDiPardo, RMFreidinger, RMWhitter, WLGould, NPLundell, GFHomnick, CFVeber, DF Design of nonpeptidal ligands for a peptide receptor: cholecystokinin antagonists. J Med Chem 30:1229-39 (1987)  
Target
Name:
Cholecystokinin receptor type A
Synonyms:
CCK-A receptor CCK1-R CCKAR_CAVPO Cholecystokinin receptor type A | Cholecystokinin-1 receptor
Type:
Mol. Mass.:
48229.77
Organism:
Cavia porcellus
Description:
Residue:
430
  
Inhibitor
Name:
BDBM25878
Synonyms:
5-(2-fluorophenyl)-1-methyl-7-nitro-2,3-dihydro-1H-1,4-benzodiazepin-2-one Flunitrazepam [3H]flunitrazepam
Type:
radiolabeled ligand
Emp. Form.:
C16H12FN3O3
Mol. Mass.:
313.2832
SMILES:
CN1c2ccc(cc2C(=NCC1=O)c1ccccc1F)[N+]([O-])=O
: