Target
Kappa-type opioid receptor
Ligand
BDBM50019098
Substrate
Meas. Tech.
ChEBML_146073
Kd
1900±n/a nM
Citation
 Lawson, JACheng, ADeGraw, JFrenking, GUyeno, EToll, LLoew, GH Effects of addition of a 2-methyl group to ethyl nipecotates (beta-meperidines) on receptor affinities and opiate agonist/antagonist activities. J Med Chem 31:2015-21 (1988)  
Target
Name:
Kappa-type opioid receptor
Synonyms:
Kappa Opioid Receptor OPRK1 Opiate Kappa 1 | mu/kappa opioid receptor
Type:
G Protein-Coupled Receptor (GPCR)
Mol. Mass.:
42744.99
Organism:
Cavia porcellus (domestic guinea pig)
Description:
P41144
Residue:
380
  
Inhibitor
Name:
BDBM50019098
Synonyms:
3-(3-Hydroxy-phenyl)-1,2-dimethyl-piperidine-3-carboxylic acid ethyl ester | CHEMBL303278
Type:
Small organic molecule
Emp. Form.:
C16H23NO3
Mol. Mass.:
277.3587
SMILES:
CCOC(=O)[C@@]1(CCCN(C)[C@H]1C)c1cccc(O)c1
: