Target
Muscarinic receptor M1
Ligand
BDBM50296314
Substrate
Meas. Tech.
ChEBML_140160
Ki
0.200000±n/a nM
Citation
 Rzeszotarski, WJMcPherson, DWFerkany, JWKinnier, WJNoronha-Blob, LKirkien-Rzeszotarski, A Affinity and selectivity of the optical isomers of 3-quinuclidinyl benzilate and related muscarinic antagonists. J Med Chem 31:1463-6 (1988)  
Target
Name:
Muscarinic receptor M1
Synonyms:
Muscarinic acetylcholine receptor M1
Type:
PROTEIN
Mol. Mass.:
15022.43
Organism:
Bos taurus
Description:
ChEMBL_140161
Residue:
139
  
Inhibitor
Name:
BDBM50296314
Synonyms:
(3R)-1-Azabicyclo[2.2.2]oct-3-yl9H-xanthene-9-carboxylate | CHEMBL549577
Type:
Small organic molecule
Emp. Form.:
C21H21NO3
Mol. Mass.:
335.3963
SMILES:
O=C(O[C@H]1CN2CCC1CC2)C1c2ccccc2Oc2ccccc12
: