Target
Muscarinic receptor M1
Ligand
BDBM50367742
Substrate
Meas. Tech.
ChEBML_140160
Ki
0.570000±n/a nM
Citation
 Rzeszotarski, WJMcPherson, DWFerkany, JWKinnier, WJNoronha-Blob, LKirkien-Rzeszotarski, A Affinity and selectivity of the optical isomers of 3-quinuclidinyl benzilate and related muscarinic antagonists. J Med Chem 31:1463-6 (1988)  
Target
Name:
Muscarinic receptor M1
Synonyms:
Muscarinic acetylcholine receptor M1
Type:
PROTEIN
Mol. Mass.:
15022.43
Organism:
Bos taurus
Description:
ChEMBL_140161
Residue:
139
  
Inhibitor
Name:
BDBM50367742
Synonyms:
CHEMBL1788199
Type:
Small organic molecule
Emp. Form.:
C21H23NO3
Mol. Mass.:
337.4122
SMILES:
OC(C(=O)O[C@@H]1CN2CCC1CC2)(c1ccccc1)c1ccccc1
: