Target
5-hydroxytryptamine receptor 2C
Ligand
BDBM50008825
Substrate
Meas. Tech.
ChEBML_1847
Ki
58±n/a nM
Citation
 Michaelides, MRSchoenleber, RThomas, SYamamoto, DMBritton, DRMacKenzie, RKebabian, JW Synthesis and pharmacological evaluation of 1-(aminomethyl)-3,4-dihydro-5-hydroxy-1H-2-benzopyrans as dopamine D1 selective ligands. J Med Chem 34:2946-53 (1991)  
Target
Name:
5-hydroxytryptamine receptor 2C
Synonyms:
5-HT-1C 5-HT1C 5-HT2C-INI 5-HTR2C 5-hydroxytryptamine receptor 2C (5-HT-2C) 5HT-1C HTR1C Serotonin (5-HT3) receptor Serotonin Receptor 2C
Type:
G Protein-Coupled Receptor (GPCR)
Mol. Mass.:
51836.79
Organism:
Homo sapiens (Human)
Description:
P28335
Residue:
458
  
Inhibitor
Name:
BDBM50008825
Synonyms:
1-Aminomethyl-3-cyclohexyl-6-methyl-isochroman-5-ol; hydrobromide | CHEMBL542436
Type:
Small organic molecule
Emp. Form.:
C17H25NO2
Mol. Mass.:
275.3859
SMILES:
Cc1ccc2[C@H](CN)O[C@@H](Cc2c1O)C1CCCCC1
: