Target
D(2) dopamine receptor
Ligand
BDBM50008826
Substrate
Meas. Tech.
ChEBML_62576
Ki
2630±n/a nM
Citation
 Michaelides, MRSchoenleber, RThomas, SYamamoto, DMBritton, DRMacKenzie, RKebabian, JW Synthesis and pharmacological evaluation of 1-(aminomethyl)-3,4-dihydro-5-hydroxy-1H-2-benzopyrans as dopamine D1 selective ligands. J Med Chem 34:2946-53 (1991)  
Target
Name:
D(2) dopamine receptor
Synonyms:
DOPAMINE D2 DOPAMINE D2 Short Dopamine D2 receptor Drd2
Type:
G Protein-Coupled Receptor (GPCR)
Mol. Mass.:
50931.60
Organism:
Rattus norvegicus (rat)
Description:
P61169
Residue:
444
  
Inhibitor
Name:
BDBM50008826
Synonyms:
3-Cyclohexyl-6-methyl-1-propylaminomethyl-isochroman-5-ol; hydrochloride | CHEMBL543389
Type:
Small organic molecule
Emp. Form.:
C20H31NO2
Mol. Mass.:
317.4656
SMILES:
CCCNC[C@@H]1O[C@@H](Cc2c(O)c(C)ccc12)C1CCCCC1
: