Target
D(1A) dopamine receptor
Ligand
BDBM50008825
Substrate
Meas. Tech.
ChEBML_58660
Ki
86±n/a nM
Citation
 Michaelides, MRSchoenleber, RThomas, SYamamoto, DMBritton, DRMacKenzie, RKebabian, JW Synthesis and pharmacological evaluation of 1-(aminomethyl)-3,4-dihydro-5-hydroxy-1H-2-benzopyrans as dopamine D1 selective ligands. J Med Chem 34:2946-53 (1991)  
Target
Name:
D(1A) dopamine receptor
Synonyms:
DOPAMINE D1 Dopamine D1 high Dopamine receptor Dopamine1-like Drd1a
Type:
Enzyme Catalytic Domain
Mol. Mass.:
49429.75
Organism:
RAT
Description:
P18901
Residue:
446
  
Inhibitor
Name:
BDBM50008825
Synonyms:
1-Aminomethyl-3-cyclohexyl-6-methyl-isochroman-5-ol; hydrobromide | CHEMBL542436
Type:
Small organic molecule
Emp. Form.:
C17H25NO2
Mol. Mass.:
275.3859
SMILES:
Cc1ccc2[C@H](CN)O[C@@H](Cc2c1O)C1CCCCC1
: