Target
Kappa-type opioid receptor
Ligand
BDBM50013388
Substrate
Meas. Tech.
ChEBML_145204
IC50
1.2±n/a nM
Citation
 Dasher, WEKlein, PNelson, WL Electrophilic opioid ligands. Oxygen tethered alpha-methylene-gamma-lactone, acrylate, isothiocyanate, and epoxide derivatives of 6 beta-naltrexol. J Med Chem 35:2374-84 (1992)  
Target
Name:
Kappa-type opioid receptor
Synonyms:
Kappa Opioid Receptor OPRK1 Opiate Kappa 1 | mu/kappa opioid receptor
Type:
G Protein-Coupled Receptor (GPCR)
Mol. Mass.:
42744.99
Organism:
Cavia porcellus (domestic guinea pig)
Description:
P41144
Residue:
380
  
Inhibitor
Name:
BDBM50013388
Synonyms:
6-Ethyl-3-(1-hydroxy-cyclopropylmethyl)-11,11-dimethyl-1,2,3,4,5,6-hexahydro-2,6-methano-benzo[d]azocin-8-ol Bremazocine | CHEMBL350384
Type:
Small organic molecule
Emp. Form.:
C20H29NO2
Mol. Mass.:
315.4498
SMILES:
CCC12CCN(CC3(O)CC3)C(Cc3ccc(O)cc13)C2(C)C
: