Target
Substance-K receptor
Ligand
BDBM50001601
Substrate
Meas. Tech.
ChEBML_209227
EC50
62±n/a nM
Citation
 Deal, MJHagan, RMIreland, SJJordan, CCMcElroy, ABPorter, BRoss, BCStephens-Smith, MWard, P Conformationally constrained tachykinin analogues: potent and highly selective neurokinin NK-2 receptor agonists. J Med Chem 35:4195-204 (1992)  
Target
Name:
Substance-K receptor
Synonyms:
NK-2 receptor NK2R_RAT Neurokinin A receptor SKR Tac2r Tacr2
Type:
Enzyme Catalytic Domain
Mol. Mass.:
43868.63
Organism:
Rattus norvegicus (Rat)
Description:
Neurokinin NK2 TACR2 Murine::P16610
Residue:
390
  
Inhibitor
Name:
BDBM50001601
Synonyms:
2-(3-{2-[2-(5-Amino-pentanoylamino)-3-phenyl-propionylamino]-3-phenyl-propionylamino}-2-oxo-pyrrolidin-1-yl)-4-methyl-pentanoic acid (1-carbamoyl-3-methylsulfanyl-propyl)-amide | CHEMBL135186
Type:
Small organic molecule
Emp. Form.:
C38H55N7O6S
Mol. Mass.:
737.952
SMILES:
CSCC[C@H](NC(=O)[C@H](CC(C)C)N1CCC(NC(=O)[C@H](Cc2ccccc2)NC(=O)[C@H](Cc2ccccc2)NC(=O)CCCCN)C1=O)C(N)=O
: