Target
D(2) dopamine receptor
Ligand
BDBM50002213
Substrate
Meas. Tech.
ChEBML_58197
IC50
7±n/a nM
Citation
 Gilligan, PJCain, GAChristos, TECook, LDrummond, SJohnson, ALKergaye, AAMcElroy, JFRohrbach, KWSchmidt, WK Novel piperidine sigma receptor ligands as potential antipsychotic drugs. J Med Chem 35:4344-61 (1992)  
Target
Name:
D(2) dopamine receptor
Synonyms:
DOPAMINE D2 Dopamine D2 receptor Drd2
Type:
Enzyme
Mol. Mass.:
50957.64
Organism:
Mus musculus (Mouse)
Description:
P61168
Residue:
444
  
Inhibitor
Name:
BDBM50002213
Synonyms:
1-(4-Fluoro-phenyl)-2-{1-[2-(1H-indol-3-yl)-ethyl]-piperidin-4-yl}-ethanone;monohydrate | CHEMBL136064
Type:
Small organic molecule
Emp. Form.:
C23H25FN2O
Mol. Mass.:
364.4558
SMILES:
Fc1ccc(cc1)C(=O)CC1CCN(CCc2c[nH]c3ccccc23)CC1
: