Target
Reverse transcriptase/RNaseH
Ligand
BDBM50368499
Substrate
Meas. Tech.
ChEMBL_196932 (CHEMBL803949)
IC50
427000±n/a nM
Citation
 Tan, GTWickramasinghe, ABaba, MHughes, SHMohan, PPezzuto, JMSingh, RVerma, S Potential anti-AIDS naphthalenesulfonic acid derivatives. Synthesis and inhibition of HIV-1 induced cytopathogenesis and HIV-1 and HIV-2 reverse transcriptase activities. J Med Chem 35:4846-53 (1992)  
Target
Name:
Reverse transcriptase/RNaseH
Synonyms:
HIV-1 Reverse Transcriptase RNase H Reverse transcriptase/RNaseH
Type:
PROTEIN
Mol. Mass.:
65229.15
Organism:
Human immunodeficiency virus 1
Description:
ChEMBL_1473730
Residue:
566
  
Inhibitor
Name:
BDBM50368499
Synonyms:
CHEMBL1744433
Type:
Small organic molecule
Emp. Form.:
C26H16N2O16S4
Mol. Mass.:
740.671
SMILES:
Oc1c(cc(NS(=O)(=O)c2ccc(cc2)-c2ccc(cc2)S(=O)(=O)Nc2cc(C([O-])=O)c(O)c(c2)S([O-])(=O)=O)cc1S([O-])(=O)=O)C([O-])=O
: