Target
Reverse transcriptase/RNaseH
Ligand
BDBM50368508
Substrate
Meas. Tech.
ChEMBL_196932 (CHEMBL803949)
IC50
52000±n/a nM
Citation
 Tan, GTWickramasinghe, ABaba, MHughes, SHMohan, PPezzuto, JMSingh, RVerma, S Potential anti-AIDS naphthalenesulfonic acid derivatives. Synthesis and inhibition of HIV-1 induced cytopathogenesis and HIV-1 and HIV-2 reverse transcriptase activities. J Med Chem 35:4846-53 (1992)  
Target
Name:
Reverse transcriptase/RNaseH
Synonyms:
HIV-1 Reverse Transcriptase RNase H Reverse transcriptase/RNaseH
Type:
PROTEIN
Mol. Mass.:
65229.15
Organism:
Human immunodeficiency virus 1
Description:
ChEMBL_1473730
Residue:
566
  
Inhibitor
Name:
BDBM50368508
Synonyms:
CHEMBL1788186
Type:
Small organic molecule
Emp. Form.:
C30H28N2O16S4
Mol. Mass.:
800.809
SMILES:
Oc1cc(cc2cc(cc(NC(=O)CCCCCCCCC(=O)Nc3cc(cc4cc(cc(O)c34)S([O-])(=O)=O)S([O-])(=O)=O)c12)S([O-])(=O)=O)S([O-])(=O)=O
: