Target
Leukotriene B4 receptor 1
Ligand
BDBM50042153
Substrate
Meas. Tech.
ChEBML_99839
Ki
3±n/a nM
Citation
 Kingsbury, WDPendrak, ILeber, JDBoehm, JCMallet, BSarau, HMFoley, JJSchmidt, DBDaines, RA Synthesis of structural analogs of leukotriene B4 and their receptor binding activity. J Med Chem 36:3308-20 (1993)  
Target
Name:
Leukotriene B4 receptor 1
Synonyms:
BLT BLTR Chemoattractant receptor-like 1 GPR16 LTB4-R 1 Leukotriene B4 R1 Leukotriene B4 receptor 1 P2Y purinoceptor 7 | P2Y7
Type:
Enzyme Catalytic Domain
Mol. Mass.:
37582.68
Organism:
Homo sapiens (Human)
Description:
Q15722
Residue:
352
  
Inhibitor
Name:
BDBM50042153
Synonyms:
CHEMBL113288 | Lithium; 3-(2-{7-[3-(3-butoxy-phenyl)-3-hydroxy-propenyl]-quinolin-2-yl}-1-hydroxy-ethyl)-benzoate
Type:
Small organic molecule
Emp. Form.:
C27H28NO5
Mol. Mass.:
446.5155
SMILES:
CCCCOc1cccc(c1)C(O)\C=C\c1cccc(CC(O)c2cccc(c2)C([O-])=O)n1
: