Target
Vesicular acetylcholine transporter
Ligand
BDBM50018094
Substrate
Meas. Tech.
ChEMBL_27659 (CHEMBL636848)
IC50
34±n/a nM
Citation
 Efange, SMKhare, AParsons, SMBau, RMetzenthin, T Nonsymmetrical bipiperidyls as inhibitors of vesicular acetylcholine storage. J Med Chem 36:985-9 (1993)  
Target
Name:
Vesicular acetylcholine transporter
Synonyms:
TorVAChT VAChT
Type:
PROTEIN
Mol. Mass.:
56111.93
Organism:
Torpedo californica
Description:
ChEMBL_1503355
Residue:
515
  
Inhibitor
Name:
BDBM50018094
Synonyms:
(1R,2R)-2-(4-Phenyl-piperidin-1-yl)-cyclohexanol 2-(4-Phenyl-piperidin-1-yl)-cyclohexanol(Vesamicol) Vesamicol | trans-2-(4-phenylpiperidin-1-yl)cyclohexanol
Type:
Small organic molecule
Emp. Form.:
C17H25NO
Mol. Mass.:
259.3865
SMILES:
O[C@@H]1CCCC[C@H]1N1CCC(CC1)c1ccccc1
: