Target
Prolyl endopeptidase
Ligand
BDBM50038879
Substrate
Meas. Tech.
ChEMBL_157472 (CHEMBL765791)
IC50
1.1±n/a nM
Citation
 Tanaka, YNiwa, SNishioka, HYamanaka, TTorizuka, MYoshinaga, KKobayashi, NIkeda, YArai, H New potent prolyl endopeptidase inhibitors: synthesis and structure-activity relationships of indan and tetralin derivatives and their analogues. J Med Chem 37:2071-8 (1994)  
Target
Name:
Prolyl endopeptidase
Synonyms:
PE POP PREP Prolyl oligopeptidase
Type:
Enzyme
Mol. Mass.:
80688.50
Organism:
Homo sapiens (Human)
Description:
P48147
Residue:
710
  
Inhibitor
Name:
BDBM50038879
Synonyms:
(S)-2-(2-Formyl-pyrrolidine-1-carbonyl)-pyrrolidine-1-carboxylic acid benzyl ester JTP-4819 | Z-PRO-PROLINAL
Type:
Small organic molecule
Emp. Form.:
C18H22N2O4
Mol. Mass.:
330.3783
SMILES:
O=C[C@@H]1CCCN1C(=O)[C@@H]1CCCN1C(=O)OCc1ccccc1
: