Target
Alpha-2A adrenergic receptor
Ligand
BDBM50036913
Substrate
Meas. Tech.
ChEMBL_33054 (CHEMBL649804)
IC50
3400±n/a nM
Citation
 Hong, SSRomstedt, KJFeller, DRHsu, FLCupps, TLLyon, RAMiller, DD A structure-activity relationship study of benzylic modifications of 4-[1-(1-naphthyl)ethyl]-1H-imidazoles on alpha 1- and alpha 2-adrenergic receptors. J Med Chem 37:2328-33 (1994)  
Target
Name:
Alpha-2A adrenergic receptor
Synonyms:
ADA2A_HUMAN ADRA2R Adrenergic alpha2A Alpha-2 adrenergic receptor subtype C10 Alpha-2A adrenoreceptor alpha-2A adrenergic receptor [Homo sapiens]
Type:
Enzyme
Mol. Mass.:
48979.91
Organism:
Homo sapiens (Human)
Description:
P08913
Residue:
465
  
Inhibitor
Name:
BDBM50036913
Synonyms:
(+-)-4-(alpha,2,3-trimethylbenzyl)imidazole CHEMBL77921 | medetomidine
Type:
Small organic molecule
Emp. Form.:
C13H16N2
Mol. Mass.:
200.2795
SMILES:
CC(c1cnc[nH]1)c1cccc(C)c1C
: