Target
Gamma-aminobutyric acid receptor subunit alpha-6/beta-2/gamma-2
Ligand
BDBM50035527
Substrate
Meas. Tech.
ChEMBL_217782 (CHEMBL824043)
Ki
45±n/a nM
Citation
 Wieland, HALüddens, H Four amino acid exchanges convert a diazepam-insensitive, inverse agonist-preferring GABAA receptor into a diazepam-preferring GABAA receptor. J Med Chem 37:4576-80 (1995)  
Target
Name:
Gamma-aminobutyric acid receptor subunit alpha-6/beta-2/gamma-2
Synonyms:
GABA A receptor alpha-6/beta-2/gamma-2 | GABA receptor alpha-6/beta-2/gamma-2 subunit
Type:
Mol. Mass.:
Description:
ASSAY_ID of EBI is 70244
Components:
This complex has 3 components.
Component 1
Name:
Gamma-aminobutyric acid receptor subunit alpha-6
Synonyms:
GABA A Alpha6Beta3Gamma2 GABA receptor alpha-6 subunit Gabra-6 Gamma-aminobutyric acid receptor subunit alpha-6
Type:
Enzyme Catalytic Domain
Mol. Mass.:
51188.24
Organism:
RAT
Description:
GABA A Alpha6Beta2Gamma2 0 RAT::P30191
Residue:
453
  
Component 2
Name:
Gamma-aminobutyric acid receptor subunit beta-2
Synonyms:
GBRB2_RAT Gabrb2 | Gamma-aminobutyric acid receptor subunit beta-2 (GABA(A) beta-2)
Type:
Enzyme
Mol. Mass.:
54648.97
Organism:
Rattus norvegicus (Rat)
Description:
P63138
Residue:
474
  
Component 3
Name:
Gamma-aminobutyric acid receptor subunit gamma-2
Synonyms:
GBRG2_RAT Gamma-aminobutyric acid receptor subunit gamma-2 (GABA(A) gamma-2)
Type:
Enzyme
Mol. Mass.:
54087.63
Organism:
Rattus norvegicus (Rat)
Description:
P18508
Residue:
466
  
Inhibitor
Name:
BDBM50035527
Synonyms:
3-Methyl-9H-beta-carboline | CHEMBL344859
Type:
Small organic molecule
Emp. Form.:
C12H10N2
Mol. Mass.:
182.2212
SMILES:
Cc1cc2c(c[nH]1)nc1ccccc21
: