Target
Gamma-aminobutyric acid receptor subunit alpha-1/beta-2/gamma-2
Ligand
BDBM50026756
Substrate
Meas. Tech.
ChEMBL_217122 (CHEMBL822942)
Ki
>10000±n/a nM
Citation
 Wieland, HALüddens, H Four amino acid exchanges convert a diazepam-insensitive, inverse agonist-preferring GABAA receptor into a diazepam-preferring GABAA receptor. J Med Chem 37:4576-80 (1995)  
Target
Name:
Gamma-aminobutyric acid receptor subunit alpha-1/beta-2/gamma-2
Synonyms:
GABA receptor alpha-1/beta-2/gamma-2 subunit GABAA Subunit α1β2γ2 | GABAA Subunit alpha-1, beta-2, gamma-2
Type:
Mol. Mass.:
Description:
ASSAY_ID of EBI is 69455
Components:
This complex has 3 components.
Component 1
Name:
Gamma-aminobutyric acid receptor subunit beta-2
Synonyms:
GBRB2_RAT Gabrb2 | Gamma-aminobutyric acid receptor subunit beta-2 (GABA(A) beta-2)
Type:
Enzyme
Mol. Mass.:
54648.97
Organism:
Rattus norvegicus (Rat)
Description:
P63138
Residue:
474
  
Component 2
Name:
Gamma-aminobutyric acid receptor subunit gamma-2
Synonyms:
GBRG2_RAT Gamma-aminobutyric acid receptor subunit gamma-2 (GABA(A) gamma-2)
Type:
Enzyme
Mol. Mass.:
54087.63
Organism:
Rattus norvegicus (Rat)
Description:
P18508
Residue:
466
  
Component 3
Name:
Gamma-aminobutyric acid receptor subunit alpha-1
Synonyms:
Benzodiazepine central GABA A Benzodiazepine GABA A Benzodiazepine Type II GABA A Benzodiazepine Type IIM GABA A Benzodiazepine omega2 GABA A alpha1 GABA receptor alpha-1 subunit GABA-PICROTOXIN Gabra-1 TBPS
Type:
Enzyme
Mol. Mass.:
51770.21
Organism:
Rattus norvegicus (Rat)
Description:
P62813
Residue:
455
  
Inhibitor
Name:
BDBM50026756
Synonyms:
3-Methyl-6-(3-trifluoromethyl-phenyl)-[1,2,4]triazolo[4,3-b]pyridazine CI-218872 CL218,872 | v3-Methyl-6-(3-trifluoromethyl-phenyl)-[1,2,4]triazolo[4,3-b]pyridazine
Type:
Small organic molecule
Emp. Form.:
C13H9F3N4
Mol. Mass.:
278.2326
SMILES:
Cc1nnc2ccc(nn12)-c1cccc(c1)C(F)(F)F
: