Target
Neuraminidase
Ligand
BDBM50032861
Substrate
Meas. Tech.
ChEMBL_200797 (CHEMBL808321)
Ki
4000±n/a nM
Citation
 Taylor, NRvon Itzstein, M Molecular modeling studies on ligand binding to sialidase from influenza virus and the mechanism of catalysis. J Med Chem 37:616-24 (1994)  
Target
Name:
Neuraminidase
Synonyms:
Influenza A Virus Neuraminidase NRAM_I34A1 Neuraminidase A
Type:
Enzyme
Mol. Mass.:
50124.14
Organism:
Influenza A virus (A/Puerto Rico/8/34/Mount Sinai(H1N1))
Description:
P03468
Residue:
454
  
Inhibitor
Name:
BDBM50032861
Synonyms:
5-((R)-Acetylamino)-4-hydroxy-6-((1R,2R)-1,2,3-trihydroxy-propyl)-5,6-dihydro-4H-pyran-2-carboxylic acid 5-Acetylamino-4-hydroxy-6-((1R,2R)-1,2,3-trihydroxy-propyl)-5,6-dihydro-4H-pyran-2-carboxylic acid anion | CHEMBL291345
Type:
Small organic molecule
Emp. Form.:
C11H17NO8
Mol. Mass.:
291.2546
SMILES:
CC(=O)NC1C(O)C=C(OC1[C@H](O)[C@H](O)CO)C(O)=O
: