Target
Kappa-type opioid receptor
Ligand
BDBM50029783
Substrate
Meas. Tech.
ChEMBL_145926 (CHEMBL752593)
IC50
2020±n/a nM
Citation
 Bertha, CMFlippen-Anderson, JLRothman, RBPorreca, FDavis, PXu, HBecketts, KCha, XYRice, KC Probes for narcotic receptor-mediated phenomena. 20. Alteration of opioid receptor subtype selectivity of the 5-(3-hydroxyphenyl)morphans by application of the message-address concept: preparation of delta-opioid receptor ligands. J Med Chem 38:1523-37 (1995)  
Target
Name:
Kappa-type opioid receptor
Synonyms:
Kappa Opioid Receptor OPRK1 Opiate Kappa 1 | mu/kappa opioid receptor
Type:
G Protein-Coupled Receptor (GPCR)
Mol. Mass.:
42744.99
Organism:
Cavia porcellus (domestic guinea pig)
Description:
P41144
Residue:
380
  
Inhibitor
Name:
BDBM50029783
Synonyms:
5-(3-Hydroxy-phenyl)-2-methyl-2-aza-bicyclo[3.3.1]nonan-7-one | CHEMBL38791
Type:
Small organic molecule
Emp. Form.:
C15H19NO2
Mol. Mass.:
245.3169
SMILES:
CN1CCC2(CC1CC(=O)C2)c1cccc(O)c1
: