Target
Delta-type opioid receptor
Ligand
BDBM50029783
Substrate
Meas. Tech.
ChEMBL_146767 (CHEMBL755211)
IC50
720±n/a nM
Citation
 Bertha, CMFlippen-Anderson, JLRothman, RBPorreca, FDavis, PXu, HBecketts, KCha, XYRice, KC Probes for narcotic receptor-mediated phenomena. 20. Alteration of opioid receptor subtype selectivity of the 5-(3-hydroxyphenyl)morphans by application of the message-address concept: preparation of delta-opioid receptor ligands. J Med Chem 38:1523-37 (1995)  
Target
Name:
Delta-type opioid receptor
Synonyms:
Cytochrome P450 3A4 Delta opioid receptor Delta-type opioid receptor (DOR) OPRD_RAT Opioid receptor Opioid receptors; mu & delta Ror-a | Voltage-gated potassium channel
Type:
G Protein-Coupled Receptor (GPCR)
Mol. Mass.:
40465.04
Organism:
Rattus norvegicus (rat)
Description:
Competition binding assays were using CHO-K1 cell membranes expressing the opioid receptor.
Residue:
372
  
Inhibitor
Name:
BDBM50029783
Synonyms:
5-(3-Hydroxy-phenyl)-2-methyl-2-aza-bicyclo[3.3.1]nonan-7-one | CHEMBL38791
Type:
Small organic molecule
Emp. Form.:
C15H19NO2
Mol. Mass.:
245.3169
SMILES:
CN1CCC2(CC1CC(=O)C2)c1cccc(O)c1
: