Target
Kappa-type opioid receptor
Ligand
BDBM50029783
Substrate
Meas. Tech.
ChEMBL_145811 (CHEMBL756077)
IC50
5071±n/a nM
Citation
 Bertha, CMEllis, MFlippen-Anderson, JLPorreca, FRothman, RBDavis, PXu, HBecketts, KRice, KC Probes for narcotic receptor-mediated phenomena. 21. Novel derivatives of 3-(1,2,3,4,5,11-hexahydro-3-methyl-2,6-methano-6H-azocino[4,5-b]indol- 6-yl)-phenols with improved delta opioid receptor selectivity. J Med Chem 39:2081-6 (1996)  
Target
Name:
Kappa-type opioid receptor
Synonyms:
Kappa Opioid Receptor OPRK1 Opiate Kappa 1 | mu/kappa opioid receptor
Type:
G Protein-Coupled Receptor (GPCR)
Mol. Mass.:
42744.99
Organism:
Cavia porcellus (domestic guinea pig)
Description:
P41144
Residue:
380
  
Inhibitor
Name:
BDBM50029783
Synonyms:
5-(3-Hydroxy-phenyl)-2-methyl-2-aza-bicyclo[3.3.1]nonan-7-one | CHEMBL38791
Type:
Small organic molecule
Emp. Form.:
C15H19NO2
Mol. Mass.:
245.3169
SMILES:
CN1CCC2(CC1CC(=O)C2)c1cccc(O)c1
: