Target
Delta-type opioid receptor
Ligand
BDBM50029783
Substrate
Meas. Tech.
ChEMBL_146752 (CHEMBL753332)
IC50
1136±n/a nM
Citation
 Bertha, CMEllis, MFlippen-Anderson, JLPorreca, FRothman, RBDavis, PXu, HBecketts, KRice, KC Probes for narcotic receptor-mediated phenomena. 21. Novel derivatives of 3-(1,2,3,4,5,11-hexahydro-3-methyl-2,6-methano-6H-azocino[4,5-b]indol- 6-yl)-phenols with improved delta opioid receptor selectivity. J Med Chem 39:2081-6 (1996)  
Target
Name:
Delta-type opioid receptor
Synonyms:
Cytochrome P450 3A4 Delta opioid receptor Delta-type opioid receptor (DOR) OPRD_RAT Opioid receptor Opioid receptors; mu & delta Ror-a | Voltage-gated potassium channel
Type:
G Protein-Coupled Receptor (GPCR)
Mol. Mass.:
40465.04
Organism:
Rattus norvegicus (rat)
Description:
Competition binding assays were using CHO-K1 cell membranes expressing the opioid receptor.
Residue:
372
  
Inhibitor
Name:
BDBM50029783
Synonyms:
5-(3-Hydroxy-phenyl)-2-methyl-2-aza-bicyclo[3.3.1]nonan-7-one | CHEMBL38791
Type:
Small organic molecule
Emp. Form.:
C15H19NO2
Mol. Mass.:
245.3169
SMILES:
CN1CCC2(CC1CC(=O)C2)c1cccc(O)c1
: