Target
Phospholipase A2, membrane associated
Ligand
BDBM50015214
Substrate
Meas. Tech.
ChEMBL_156362 (CHEMBL761692)
IC50
320000000±n/a nM
Citation
 Teshirogi, IMatsutani, SShirahase, KFujii, YYoshida, TTanaka, KOhtani, M Synthesis and phospholipase A2 inhibitory activity of thielocin B3 derivatives. J Med Chem 39:5183-91 (1997)  
Target
Name:
Phospholipase A2, membrane associated
Synonyms:
PA2GA_RAT Pla2g2a
Type:
PROTEIN
Mol. Mass.:
16307.95
Organism:
Rattus norvegicus
Description:
ChEMBL_537135
Residue:
146
  
Inhibitor
Name:
BDBM50015214
Synonyms:
6-chloro-2-methoxy-9-acridinyl(4-diethylamino-1-methylbutyl)amine CHEMBL7568 N*4*-(6-Chloro-2-methoxy-acridin-9-yl)-N*1*,N*1*-diethyl-pentane-1,4-diamine N*4*-(6-Chloro-2-methoxy-acridin-9-yl)-N*1*,N*1*-diethyl-pentane-1,4-diamine ; (mepacrine) cid_237 | quinacrine
Type:
Small organic molecule
Emp. Form.:
C23H30ClN3O
Mol. Mass.:
399.957
SMILES:
CCN(CC)CCCC(C)Nc1c2ccc(Cl)cc2nc2ccc(OC)cc12
: