Target
Glutamate receptor 2
Ligand
BDBM17661
Substrate
Meas. Tech.
ChEMBL_90152 (CHEMBL696974)
Ki
898±n/a nM
Citation
 Jane, DEHoo, KKamboj, RDeverill, MBleakman, DMandelzys, A Synthesis of willardiine and 6-azawillardiine analogs: pharmacological characterization on cloned homomeric human AMPA and kainate receptor subtypes. J Med Chem 40:3645-50 (1997)  
Target
Name:
Glutamate receptor 2
Synonyms:
AMPA-selective glutamate receptor 2 GRIA2 GluR-2 GluR-K2 Glutamate receptor 2 Glutamate receptor AMPA 2/3 Glutamate receptor ionotropic, AMPA 2
Type:
Enzyme Catalytic Domain
Mol. Mass.:
98825.96
Organism:
Homo sapiens (Human)
Description:
Glutamate AMPA 2 GRIA2 HUMAN::P42262
Residue:
883
  
Inhibitor
Name:
BDBM17661
Synonyms:
(2S)-2-amino-3-(2,4-dioxo-1,2,3,4-tetrahydropyrimidin-1-yl)propanoic acid CHEMBL122005 | willardiine
Type:
Small organic molecule
Emp. Form.:
C7H9N3O4
Mol. Mass.:
199.1641
SMILES:
N[C@@H](Cn1ccc(=O)[nH]c1=O)C(O)=O
: