Target
Glutamate receptor 1
Ligand
BDBM50060633
Substrate
Meas. Tech.
ChEMBL_90141 (CHEMBL878883)
Ki
240±n/a nM
Citation
 Jane, DEHoo, KKamboj, RDeverill, MBleakman, DMandelzys, A Synthesis of willardiine and 6-azawillardiine analogs: pharmacological characterization on cloned homomeric human AMPA and kainate receptor subtypes. J Med Chem 40:3645-50 (1997)  
Target
Name:
Glutamate receptor 1
Synonyms:
AMPA-selective glutamate receptor 1 GLUR1 GRIA1_HUMAN GluR-A Glutamate AMPA 1 Glutamate receptor AMPA 1/2 Glutamate receptor ionotropic, AMPA 1
Type:
Enzyme Catalytic Domain
Mol. Mass.:
101512.92
Organism:
Homo sapiens (Human)
Description:
Glutamate AMPA 1 GRIA1 HUMAN::P42261
Residue:
906
  
Inhibitor
Name:
BDBM50060633
Synonyms:
(S)-2-Amino-3-(6-methyl-3,5-dioxo-4,5-dihydro-3H-[1,2,4]triazin-2-yl)-propionic acid | CHEMBL120808
Type:
Small organic molecule
Emp. Form.:
C7H10N4O4
Mol. Mass.:
214.1787
SMILES:
Cc1nn(C[C@H](N)C(O)=O)c(=O)[nH]c1=O
: