Target
Alpha-1A adrenergic receptor
Ligand
BDBM50057449
Substrate
Meas. Tech.
ChEMBL_34012 (CHEMBL645379)
IC50
1±n/a nM
Citation
 Kenny, BBallard, SBlagg, JFox, D Pharmacological options in the treatment of benign prostatic hyperplasia. J Med Chem 40:1293-315 (1997)  
Target
Name:
Alpha-1A adrenergic receptor
Synonyms:
ADA1A_RAT Adra1c Alpha-1A adrenoceptor Alpha-1C adrenergic receptor | adrenergic Alpha1A
Type:
Protein
Mol. Mass.:
51620.15
Organism:
Rattus norvegicus (Rat)
Description:
P43140
Residue:
466
  
Inhibitor
Name:
BDBM50057449
Synonyms:
3-Methyl-4-oxo-2-phenyl-4H-chromene-8-carboxylic acid {3-[4-(5-chloro-2-methyl-phenyl)-piperazin-1-yl]-propyl}-amide | CHEMBL278518
Type:
Small organic molecule
Emp. Form.:
C31H32ClN3O3
Mol. Mass.:
530.057
SMILES:
Cc1ccc(Cl)cc1N1CCN(CCCNC(=O)c2cccc3c2oc(c(C)c3=O)-c2ccccc2)CC1
: