Target
Glucocorticoid receptor
Ligand
BDBM50062429
Substrate
Meas. Tech.
ChEMBL_71394 (CHEMBL681746)
Ki
210±n/a nM
Citation
 Edwards, JPZhi, LPooley, CLTegley, CMWest, SJWang, MWGottardis, MMPathirana, CSchrader, WTJones, TK Preparation, resolution, and biological evaluation of 5-aryl-1, 2-dihydro-5H-chromeno[3,4-f]quinolines: potent, orally active, nonsteroidal progesterone receptor agonists. J Med Chem 41:2779-85 (1998)  
Target
Name:
Glucocorticoid receptor
Synonyms:
GCR_HUMAN GRL Glucocorticoid receptor (GRFP) Nuclear receptor subfamily 3 group C member 1
Type:
Enzyme
Mol. Mass.:
85656.87
Organism:
Homo sapiens (Human)
Description:
P04150
Residue:
777
  
Inhibitor
Name:
BDBM50062429
Synonyms:
5-(4-Chloro-3-methyl-phenyl)-9-fluoro-2,2,4-trimethyl-2,5-dihydro-1H-6-oxa-1-aza-chrysene | CHEMBL94749
Type:
Small organic molecule
Emp. Form.:
C26H23ClFNO
Mol. Mass.:
419.918
SMILES:
CC1=CC(C)(C)Nc2ccc3-c4cc(F)ccc4OC(c4ccc(Cl)c(C)c4)c3c12
: