Target
Nitric oxide synthase, brain
Ligand
BDBM50225106
Substrate
Meas. Tech.
ChEMBL_143377 (CHEMBL752276)
Ki
15±n/a nM
Citation
 Collins, JLShearer, BGOplinger, JALee, SGarvey, EPSalter, MDuffy, CBurnette, TCFurfine, ES N-Phenylamidines as selective inhibitors of human neuronal nitric oxide synthase: structure-activity studies and demonstration of in vivo activity. J Med Chem 41:2858-71 (1998)  
Target
Name:
Nitric oxide synthase, brain
Synonyms:
Constitutive NOS NC-NOS NOS type I nNOS NOS1_HUMAN Neuronal nitric oxide synthase Nitric oxide synthase, neuronal (nNOS) bNOS | nNOS
Type:
Homodimer
Mol. Mass.:
160985.98
Organism:
Homo sapiens (Human)
Description:
P29475
Residue:
1434
  
Inhibitor
Name:
BDBM50225106
Synonyms:
(2S)-2-amino-5-{[(E)-amino(nitroimino)methyl]amino}pentanoic acid (2S)-2-amino-5-{[(E)-imino(nitroamino)methyl]amino}pentanoic acid (S)-2-Amino-5-(N'-nitro-guanidino)-pentanoic acid CHEMBL227744 N-nitro-L-arginine Ngamma-nitro-L-arginine | Nomega-nitro-L-arginine
Type:
Small organic molecule
Emp. Form.:
C6H13N5O4
Mol. Mass.:
219.1985
SMILES:
N[C@@H](CCCNC(N)=N[N+]([O-])=O)C(O)=O
: