Target
B2 bradykinin receptor
Ligand
BDBM50067238
Substrate
Meas. Tech.
ChEMBL_40264 (CHEMBL653280)
IC50
2.2±n/a nM
Citation
 Abe, YKayakiri, HSatoh, SInoue, TSawada, YInamura, NAsano, MHatori, CSawai, HOku, TTanaka, H A novel class of orally active non-peptide bradykinin B2 receptor antagonists. 2. Overcoming the species difference between guinea pig and man. J Med Chem 41:4053-61 (1998)  
Target
Name:
B2 bradykinin receptor
Synonyms:
B2 bradykinin receptor BDKRB2 BKRB2_CAVPO | Bradykinin B2 receptor
Type:
Mol. Mass.:
42217.03
Organism:
Cavia porcellus
Description:
Residue:
372
  
Inhibitor
Name:
BDBM50067238
Synonyms:
3-[3-({[3-(3-Bromo-2-methyl-imidazo[1,2-a]pyridin-8-yloxymethyl)-2,4-dichloro-phenyl]-methyl-carbamoyl}-methyl)-ureido]-benzoic acid ethyl ester | CHEMBL422794
Type:
Small organic molecule
Emp. Form.:
C28H26BrCl2N5O5
Mol. Mass.:
663.347
SMILES:
CCOC(=O)c1cccc(NC(=O)NCC(=O)N(C)c2ccc(Cl)c(COc3cccn4c(Br)c(C)nc34)c2Cl)c1
: