Target
B2 bradykinin receptor
Ligand
BDBM50067256
Substrate
Meas. Tech.
ChEMBL_40264 (CHEMBL653280)
IC50
1.4±n/a nM
Citation
 Abe, YKayakiri, HSatoh, SInoue, TSawada, YInamura, NAsano, MHatori, CSawai, HOku, TTanaka, H A novel class of orally active non-peptide bradykinin B2 receptor antagonists. 2. Overcoming the species difference between guinea pig and man. J Med Chem 41:4053-61 (1998)  
Target
Name:
B2 bradykinin receptor
Synonyms:
B2 bradykinin receptor BDKRB2 BKRB2_CAVPO | Bradykinin B2 receptor
Type:
Mol. Mass.:
42217.03
Organism:
Cavia porcellus
Description:
Residue:
372
  
Inhibitor
Name:
BDBM50067256
Synonyms:
CHEMBL559195 | N-[3-(3-Bromo-2-methyl-imidazo[1,2-a]pyridin-8-yloxymethyl)-2,4-dichloro-phenyl]-N-methyl-2-(3-phenyl-ureido)-acetamide; hydrochloride
Type:
Small organic molecule
Emp. Form.:
C25H22BrCl2N5O3
Mol. Mass.:
591.284
SMILES:
CN(C(=O)CNC(=O)Nc1ccccc1)c1ccc(Cl)c(COc2cccn3c(Br)c(C)nc23)c1Cl
: