Target
B2 bradykinin receptor
Ligand
BDBM50067249
Substrate
Meas. Tech.
ChEMBL_40264 (CHEMBL653280)
IC50
5.3±n/a nM
Citation
 Abe, YKayakiri, HSatoh, SInoue, TSawada, YInamura, NAsano, MHatori, CSawai, HOku, TTanaka, H A novel class of orally active non-peptide bradykinin B2 receptor antagonists. 2. Overcoming the species difference between guinea pig and man. J Med Chem 41:4053-61 (1998)  
Target
Name:
B2 bradykinin receptor
Synonyms:
B2 bradykinin receptor BDKRB2 BKRB2_CAVPO | Bradykinin B2 receptor
Type:
Mol. Mass.:
42217.03
Organism:
Cavia porcellus
Description:
Residue:
372
  
Inhibitor
Name:
BDBM50067249
Synonyms:
CHEMBL544600 | N-({[3-(3-Bromo-2-methyl-imidazo[1,2-a]pyridin-8-yloxymethyl)-2,4-dichloro-phenyl]-methyl-carbamoyl}-methyl)-2-phenyl-acetamide; hydrochloride
Type:
Small organic molecule
Emp. Form.:
C26H23BrCl2N4O3
Mol. Mass.:
590.296
SMILES:
CN(C(=O)CNC(=O)Cc1ccccc1)c1ccc(Cl)c(COc2cccn3c(Br)c(C)nc23)c1Cl
: